Reaction Details
TargetBotulinum neurotoxin type A
LigandBDBM52237
Substrate/Competitorn/a
Meas. Tech.ChEMBL_1652630 (CHEMBL4001885)
IC50 700±n/a nM
Citation Harrell, WAVieira, RCEnsel, SMMontgomery, VGuernieri, REccard, VSCampbell, YRoxas-Duncan, VCardellina, JHWebb, RPSmith, LA A matrix-focused structure-activity and binding site flexibility study of quinolinol inhibitors of botulinum neurotoxin serotype A. Bioorg Med Chem Lett27:675-678 (2017) 
 
Botulinum neurotoxin type A
Name:Botulinum neurotoxin type A
Type:PROTEIN
Mol. Mass.:149450.01
Organism:Clostridium botulinum
Description:ChEMBL_1510137
Residue:1296
BDBM52237
NameBDBM52237
Synonyms:2-methyl-7-[phenyl-(2-pyridinylamino)methyl]-8-quinolinol 2-methyl-7-[phenyl-(pyridin-2-ylamino)methyl]quinolin-8-ol Oxyquinoline, D2, #5 cid_4999481
TypeSmall organic molecule
Emp. Form.C22H19N3O
Mol. Mass.341.4058
SMILESCc1ccc2ccc(C(Nc3ccccn3)c3ccccc3)c(O)c2n1