Reaction Details
TargetTyrosine-protein kinase receptor UFO
LigandBDBM50234295
Substrate/Competitorn/a
Meas. Tech.ChEMBL_1652652 (CHEMBL4001907)
IC50 43±n/a nM
Citation Keung, WBoloor, ABrown, JKiryanov, AGangloff, ALawson, JDSkene, RHoffman, IAtienza, JKahana, JDe Jong, RFarrell, PBalakrishna, DHalkowycz, P Structure-based optimization of 1H-imidazole-2-carboxamides as Axl kinase inhibitors utilizing a Mer mutant surrogate. Bioorg Med Chem Lett27:1099-1104 (2017) 
 
Tyrosine-protein kinase receptor UFO
Name:Tyrosine-protein kinase receptor UFO
Type:Enzyme
Mol. Mass.:98316.97
Organism:Homo sapiens (Human)
Description:P30530
Residue:894
BDBM50234295
NameBDBM50234295
Synonyms:CHEMBL4080569
TypeSmall organic molecule
Emp. Form.C20H20N6O3S2
Mol. Mass.456.541
SMILESCS(=O)(=O)N1CCC[C@@H](C1)c1csc(n1)-c1ccccc1NC(=O)c1nc(c[nH]1)C#N