Reaction Details
TargetTyrosine-protein kinase receptor UFO
LigandBDBM50234305
Substrate/Competitorn/a
Meas. Tech.ChEMBL_1652652 (CHEMBL4001907)
IC50 1.8±n/a nM
Citation Keung, WBoloor, ABrown, JKiryanov, AGangloff, ALawson, JDSkene, RHoffman, IAtienza, JKahana, JDe Jong, RFarrell, PBalakrishna, DHalkowycz, P Structure-based optimization of 1H-imidazole-2-carboxamides as Axl kinase inhibitors utilizing a Mer mutant surrogate. Bioorg Med Chem Lett27:1099-1104 (2017) 
 
Tyrosine-protein kinase receptor UFO
Name:Tyrosine-protein kinase receptor UFO
Type:Enzyme
Mol. Mass.:98316.97
Organism:Homo sapiens (Human)
Description:P30530
Residue:894
BDBM50234305
NameBDBM50234305
Synonyms:CHEMBL4090103
TypeSmall organic molecule
Emp. Form.C23H30N6O4S2
Mol. Mass.518.652
SMILESCN(C)CCOc1ccc(NC(=O)c2ncc[nH]2)c(c1)-c1nc(cs1)[C@H]1CCCN(C1)S(C)(=O)=O