Reaction Details
TargetUbiquitin carboxyl-terminal hydrolase 7
LigandBDBM50234339
Substrate/Competitorn/a
Meas. Tech.ChEBML_1652681
IC50 6120±n/a nM
Citation Chen, CSong, JWang, JXu, CChen, CGu, WSun, HWen, X Synthesis and biological evaluation of thiazole derivatives as novel USP7 inhibitors. Bioorg Med Chem Lett27:845-849 (2017) 
 
Ubiquitin carboxyl-terminal hydrolase 7
Name:Ubiquitin carboxyl-terminal hydrolase 7
Type:PROTEIN
Mol. Mass.:128274.45
Organism:Homo sapiens (Human)
Description:ChEMBL_1469483
Residue:1102
BDBM50234339
NameBDBM50234339
Synonyms:CHEMBL4105608
TypeSmall organic molecule
Emp. Form.C11H6F2N2O3S2
Mol. Mass.316.304
SMILESCC(=O)c1nc(c(Sc2ccc(F)cc2F)s1)[N+]([O-])=O