Reaction Details
TargetUbiquitin carboxyl-terminal hydrolase 7
LigandBDBM50234341
Substrate/Competitorn/a
Meas. Tech.ChEMBL_1652681 (CHEMBL4001936)
IC50 2650±n/a nM
Citation Chen, CSong, JWang, JXu, CChen, CGu, WSun, HWen, X Synthesis and biological evaluation of thiazole derivatives as novel USP7 inhibitors. Bioorg Med Chem Lett27:845-849 (2017) 
 
Ubiquitin carboxyl-terminal hydrolase 7
Name:Ubiquitin carboxyl-terminal hydrolase 7
Type:PROTEIN
Mol. Mass.:128274.45
Organism:Homo sapiens (Human)
Description:ChEMBL_1469483
Residue:1102
BDBM50234341
NameBDBM50234341
Synonyms:CHEMBL4079850
TypeSmall organic molecule
Emp. Form.C16H9Cl2FN4O3S2
Mol. Mass.459.302
SMILES[O-][N+](=O)c1nc(sc1Sc1c(Cl)cncc1Cl)C(=O)NCc1ccc(F)cc1