Reaction Details
TargetUbiquitin carboxyl-terminal hydrolase 7
LigandBDBM50234357
Substrate/Competitorn/a
Meas. Tech.ChEMBL_1652681 (CHEMBL4001936)
IC50 40490±n/a nM
Citation Chen, CSong, JWang, JXu, CChen, CGu, WSun, HWen, X Synthesis and biological evaluation of thiazole derivatives as novel USP7 inhibitors. Bioorg Med Chem Lett27:845-849 (2017) 
 
Ubiquitin carboxyl-terminal hydrolase 7
Name:Ubiquitin carboxyl-terminal hydrolase 7
Type:PROTEIN
Mol. Mass.:128274.45
Organism:Homo sapiens (Human)
Description:ChEMBL_1469483
Residue:1102
BDBM50234357
NameBDBM50234357
Synonyms:CHEMBL4090158
TypeSmall organic molecule
Emp. Form.C15H8Cl2N4O3S2
Mol. Mass.427.285
SMILES[O-][N+](=O)c1nc(sc1Sc1c(Cl)cncc1Cl)C(=O)Nc1ccccc1