Reaction Details
TargetCytochrome P450 3A4
LigandBDBM50234534
Substrate/Competitorn/a
Meas. Tech.ChEMBL_1653091 (CHEMBL4002346)
IC50 3.0±n/a nM
Citation Buchynskyy, AGillespie, JRHulverson, MAMcQueen, JCreason, SARanade, RMDuster, NAGelb, MHBuckner, FS Discovery of N-(2-aminoethyl)-N-benzyloxyphenyl benzamides: New potent Trypanosoma brucei inhibitors. Bioorg Med Chem25:1571-1584 (2017) 
 
Cytochrome P450 3A4
Name:Cytochrome P450 3A4
Type:Enzyme
Mol. Mass.:57349.57
Organism:Homo sapiens (Human)
Description:n/a
Residue:503
BDBM50234534
NameBDBM50234534
Synonyms:CHEMBL4088945
TypeSmall organic molecule
Emp. Form.C24H25Cl3N2O2
Mol. Mass.479.827
SMILESCl.Cc1cc(C)cc(COc2ccc(cc2)N(CCN)C(=O)c2ccc(Cl)cc2Cl)c1