Reaction Details
TargetAlpha-galactosidase A
LigandBDBM50234561
Substrate/Competitorn/a
Meas. Tech.ChEMBL_1653299 (CHEMBL4002665)
IC50 32800±n/a nM
Citation Cheng, WCWang, JHYun, WYLi, HYHu, JM Rapid preparation of (3R,4S,5R) polyhydroxylated pyrrolidine-based libraries to discover a pharmacological chaperone for treatment of Fabry disease. Eur J Med Chem126:1-6 (2017) 
 
Alpha-galactosidase A
Name:Alpha-galactosidase A
Type:Protein
Mol. Mass.:48760.21
Organism:Homo sapiens (Human)
Description:n/a
Residue:429
BDBM50234561
NameBDBM50234561
Synonyms:CHEMBL4090087
TypeSmall organic molecule
Emp. Form.C16H21BrN2O5
Mol. Mass.401.252
SMILESCOc1ccc(Br)cc1\C=C\C(=O)NC[C@H]1N[C@H](CO)[C@H](O)[C@@H]1O