Reaction Details
TargetAlpha-galactosidase A
LigandBDBM50234559
Substrate/Competitorn/a
Meas. Tech.ChEMBL_1653300 (CHEMBL4002666)
IC50 2100±n/a nM
Citation Cheng, WCWang, JHYun, WYLi, HYHu, JM Rapid preparation of (3R,4S,5R) polyhydroxylated pyrrolidine-based libraries to discover a pharmacological chaperone for treatment of Fabry disease. Eur J Med Chem126:1-6 (2017) 
 
Alpha-galactosidase A
Name:Alpha-galactosidase A
Type:Protein
Mol. Mass.:48760.21
Organism:Homo sapiens (Human)
Description:n/a
Residue:429
BDBM50234559
NameBDBM50234559
Synonyms:CHEMBL4081664
TypeSmall organic molecule
Emp. Form.C17H32N2O4
Mol. Mass.328.447
SMILESOC[C@H]1N[C@H](CNC(=O)CCCCC2CCCCC2)[C@@H](O)[C@H]1O