Reaction Details
TargetFibroblast growth factor receptor 2
LigandBDBM50234570
Substrate/Competitorn/a
Meas. Tech.ChEMBL_1653400 (CHEMBL4002766)
IC50 0.300000±n/a nM
Citation Liu, YPeng, XGuan, XLu, DXi, YJin, SChen, HZeng, LAi, JGeng, MHu, Y Discovery of novel Ponatinib analogues for reducing KDR activity as potent FGFRs inhibitors. Eur J Med Chem126:122-132 (2017) 
 
Fibroblast growth factor receptor 2
Name:Fibroblast growth factor receptor 2
Type:Enzyme
Mol. Mass.:92015.45
Organism:Homo sapiens (Human)
Description:P21802
Residue:821
BDBM50234570
NameBDBM50234570
Synonyms:CHEMBL4091628
TypeSmall organic molecule
Emp. Form.C31H31ClF3N5O2
Mol. Mass.598.058
SMILESCN1CCN(Cc2ccc(NC(=O)c3ccc(Cl)c(c3)C#Cc3cncc(c3)N3CCOCC3)cc2C(F)(F)F)CC1