Reaction Details
TargetProtein Mdm4
LigandBDBM50234678
Substrate/Competitorn/a
Meas. Tech.ChEMBL_1653672 (CHEMBL4003038)
Ki 16170±n/a nM
Citation Surmiak, ENeochoritis, CGMusielak, BTwarda-Clapa, AKurpiewska, KDubin, GCamacho, CHolak, TADömling, A Rational design and synthesis of 1,5-disubstituted tetrazoles as potent inhibitors of the MDM2-p53 interaction. Eur J Med Chem126:384-407 (2017) 
 
Protein Mdm4
Name:Protein Mdm4
Type:Oncoprotein
Mol. Mass.:54842.04
Organism:Homo sapiens (Human)
Description:The HDMX(1-188) were expressed in Escherichia coli BL21 (DE3) as a GST fusion and purified on glutathione sepharose.
Residue:490
BDBM50234678
NameBDBM50234678
Synonyms:CHEMBL4098742
TypeSmall organic molecule
Emp. Form.C31H31ClN6O3
Mol. Mass.571.069
SMILESCCOC(=O)c1[nH]c2cc(Cl)ccc2c1C(NC1CCCC1)c1nnnn1-c1cccc(OCc2ccccc2)c1