Reaction Details
TargetProtein Mdm4
LigandBDBM50234674
Substrate/Competitorn/a
Meas. Tech.ChEMBL_1653672 (CHEMBL4003038)
Ki 44000±n/a nM
Citation Surmiak, ENeochoritis, CGMusielak, BTwarda-Clapa, AKurpiewska, KDubin, GCamacho, CHolak, TADömling, A Rational design and synthesis of 1,5-disubstituted tetrazoles as potent inhibitors of the MDM2-p53 interaction. Eur J Med Chem126:384-407 (2017) 
 
Protein Mdm4
Name:Protein Mdm4
Type:Oncoprotein
Mol. Mass.:54842.04
Organism:Homo sapiens (Human)
Description:The HDMX(1-188) were expressed in Escherichia coli BL21 (DE3) as a GST fusion and purified on glutathione sepharose.
Residue:490
BDBM50234674
NameBDBM50234674
Synonyms:CHEMBL4086384
TypeSmall organic molecule
Emp. Form.C24H24Cl2N6O2
Mol. Mass.499.392
SMILESOC(=O)c1[nH]c2cc(Cl)ccc2c1C(NCC1CCCCC1)c1nnnn1-c1ccc(Cl)cc1