Reaction Details
TargetIntestinal-type alkaline phosphatase
LigandBDBM18073
Substrate/Competitorn/a
Meas. Tech.ChEMBL_1653677 (CHEMBL4003043)
IC50 80210±n/a nM
Citation Miliutina, MEjaz, SAKhan, SUIaroshenko, VOVillinger, AIqbal, JLanger, P Synthesis, alkaline phosphatase inhibition studies and molecular docking of novel derivatives of 4-quinolones. Eur J Med Chem126:408-420 (2017) 
 
Intestinal-type alkaline phosphatase
Name:Intestinal-type alkaline phosphatase
Type:Protein
Mol. Mass.:57094.82
Organism:Bos taurus (Cattle)
Description:P19111
Residue:533
BDBM18073
NameBDBM18073
Synonyms:(2S)-2-amino-3-phenylpropanoic acid L-[2,3,4,5,6-3H]phenylalanine Phenylalanine | US11021454, Compound L-phe
TypeAmino Acid
Emp. Form.C9H11NO2
Mol. Mass.165.1891
SMILESN[C@@H](Cc1ccccc1)C(O)=O