Reaction Details
TargetAlkaline phosphatase, tissue-nonspecific isozyme
LigandBDBM50234719
Substrate/Competitorn/a
Meas. Tech.ChEMBL_1653676 (CHEMBL4003042)
IC50 1510±n/a nM
Citation Miliutina, MEjaz, SAKhan, SUIaroshenko, VOVillinger, AIqbal, JLanger, P Synthesis, alkaline phosphatase inhibition studies and molecular docking of novel derivatives of 4-quinolones. Eur J Med Chem126:408-420 (2017) 
 
Alkaline phosphatase, tissue-nonspecific isozyme
Name:Alkaline phosphatase, tissue-nonspecific isozyme
Type:Protein
Mol. Mass.:57195.60
Organism:Bos taurus (Cattle)
Description:P09487
Residue:524
BDBM50234719
NameBDBM50234719
Synonyms:CHEMBL4062180
TypeSmall organic molecule
Emp. Form.C22H24N2O4
Mol. Mass.380.437
SMILESCCCCCc1cc(=O)c2cc(ccc2n1Cc1ccc(OC)cc1)[N+]([O-])=O