Reaction Details
TargetCholinesterase
LigandBDBM8961
Substrate/Competitorn/a
Meas. Tech.ChEMBL_1653859 (CHEMBL4003225)
IC50 0.050000±n/a nM
Citation Dgachi, YSokolov, OLuzet, VGodyn, JPanek, DBonet, AMartin, HIriepa, IMoraleda, IGarcía-Iriepa, CJanockova, JRichert, LSoukup, OMalawska, BChabchoub, FMarco-Contelles, JIsmaili, L Tetrahydropyranodiquinolin-8-amines as new, non hepatotoxic, antioxidant, and acetylcholinesterase inhibitors for Alzheimer's disease therapy. Eur J Med Chem126:576-589 (2017) 
 
Cholinesterase
Name:Cholinesterase
Type:Enzyme
Mol. Mass.:65643.35
Organism:Equus caballus (Horse)
Description:P81908
Residue:574
BDBM8961
NameBDBM8961
Synonyms:1,2,3,4-tetrahydro-9-acridinamine 9-THA CHEMBL1337960 Cognex Tracine cid_1935 | tacrine.HCl
TypeSmall organic molecule
Emp. Form.C13H14N2
Mol. Mass.198.2637
SMILESNc1c2CCCCc2nc2ccccc12