Reaction Details
TargetAcetylcholinesterase
LigandBDBM50234777
Substrate/Competitorn/a
Meas. Tech.ChEMBL_1653857 (CHEMBL4003223)
IC50 140±n/a nM
Citation Dgachi, YSokolov, OLuzet, VGodyn, JPanek, DBonet, AMartin, HIriepa, IMoraleda, IGarcía-Iriepa, CJanockova, JRichert, LSoukup, OMalawska, BChabchoub, FMarco-Contelles, JIsmaili, L Tetrahydropyranodiquinolin-8-amines as new, non hepatotoxic, antioxidant, and acetylcholinesterase inhibitors for Alzheimer's disease therapy. Eur J Med Chem126:576-589 (2017) 
 
Acetylcholinesterase
Name:Acetylcholinesterase
Type:Enzyme
Mol. Mass.:71812.79
Organism:Electrophorus electricus (Electric eel)
Description:n/a
Residue:633
BDBM50234777
NameBDBM50234777
Synonyms:CHEMBL4080318
TypeSmall organic molecule
Emp. Form.C25H20BrN3O
Mol. Mass.458.35
SMILESNc1c2CCCCc2nc2Oc3c(ccc4cccnc34)C(c3ccccc3Br)c12