Reaction Details
TargetAcetylcholinesterase
LigandBDBM50234768
Substrate/Competitorn/a
Meas. Tech.ChEMBL_1653857 (CHEMBL4003223)
IC50 40±n/a nM
Citation Dgachi, YSokolov, OLuzet, VGodyn, JPanek, DBonet, AMartin, HIriepa, IMoraleda, IGarcía-Iriepa, CJanockova, JRichert, LSoukup, OMalawska, BChabchoub, FMarco-Contelles, JIsmaili, L Tetrahydropyranodiquinolin-8-amines as new, non hepatotoxic, antioxidant, and acetylcholinesterase inhibitors for Alzheimer's disease therapy. Eur J Med Chem126:576-589 (2017) 
 
Acetylcholinesterase
Name:Acetylcholinesterase
Type:Enzyme
Mol. Mass.:71812.79
Organism:Electrophorus electricus (Electric eel)
Description:n/a
Residue:633
BDBM50234768
NameBDBM50234768
Synonyms:CHEMBL4085738
TypeSmall organic molecule
Emp. Form.C26H23N3O2
Mol. Mass.409.4797
SMILESCOc1ccc(cc1)C1c2ccc3cccnc3c2Oc2nc3CCCCc3c(N)c12