Reaction Details
TargetAcetylcholinesterase
LigandBDBM50234778
Substrate/Competitorn/a
Meas. Tech.ChEMBL_1653857 (CHEMBL4003223)
IC50 100±n/a nM
Citation Dgachi, YSokolov, OLuzet, VGodyn, JPanek, DBonet, AMartin, HIriepa, IMoraleda, IGarcía-Iriepa, CJanockova, JRichert, LSoukup, OMalawska, BChabchoub, FMarco-Contelles, JIsmaili, L Tetrahydropyranodiquinolin-8-amines as new, non hepatotoxic, antioxidant, and acetylcholinesterase inhibitors for Alzheimer's disease therapy. Eur J Med Chem126:576-589 (2017) 
 
Acetylcholinesterase
Name:Acetylcholinesterase
Type:Enzyme
Mol. Mass.:71812.79
Organism:Electrophorus electricus (Electric eel)
Description:n/a
Residue:633
BDBM50234778
NameBDBM50234778
Synonyms:CHEMBL4088178
TypeSmall organic molecule
Emp. Form.C25H19Cl2N3O
Mol. Mass.448.344
SMILESNc1c2CCCCc2nc2Oc3c(ccc4cccnc34)C(c3c(Cl)cccc3Cl)c12