Reaction Details
TargetVascular endothelial growth factor receptor 2
LigandBDBM50234811
Substrate/Competitorn/a
Meas. Tech.ChEMBL_1653995 (CHEMBL4003361)
IC50 23±n/a nM
Citation Murár, MDobia?, J?ramel, PAddová, GHanquet, GBohác, A Novel CLK1 inhibitors based on N-aryloxazol-2-amine skeleton - A possible way to dual VEGFR2 TK/CLK ligands. Eur J Med Chem126:754-761 (2017) 
 
Vascular endothelial growth factor receptor 2
Name:Vascular endothelial growth factor receptor 2
Type:Receptor Tyrosine Kinase
Mol. Mass.:151510.97
Organism:Homo sapiens (Human)
Description:P35968
Residue:1356
BDBM50234811
NameBDBM50234811
Synonyms:CHEMBL4086603
TypeSmall organic molecule
Emp. Form.C25H22N4O4S
Mol. Mass.474.532
SMILESCCS(=O)(=O)c1ccc(OC)c(Nc2ncc(o2)-c2ccc(CC#N)c(c2)-c2ccccn2)c1