Reaction Details
TargetGlycogen synthase kinase-3
LigandBDBM50234810
Substrate/Competitorn/a
Meas. Tech.ChEMBL_1653993 (CHEMBL4003359)
IC50 7500±n/a nM
Citation Murár, MDobia?, J?ramel, PAddová, GHanquet, GBohác, A Novel CLK1 inhibitors based on N-aryloxazol-2-amine skeleton - A possible way to dual VEGFR2 TK/CLK ligands. Eur J Med Chem126:754-761 (2017) 
 
Glycogen synthase kinase-3
Name:Glycogen synthase kinase-3
Synonyms:Glycogen synthase kinase-3 alpha/beta
Type:n/a
Mol. Mass.:n/a
Description:ASSAY_ID of ChEMBL is 2193535
Components:This complex has 2 components.
Component 1
Name:Glycogen synthase kinase-3 alpha
Type:Enzyme
Mol. Mass.:50991.79
Organism:Homo sapiens (Human)
Description:P49840
Residue:483
Component 2
Name:Glycogen synthase kinase-3 beta
Synonyms:GSK-3 beta GSK3B Glycogen synthase kinase 3 beta (GSK3B) Glycogen synthase kinase-3 beta (GSK-3B) Glycogen synthase kinase-3 beta (GSK3B) Glycogen synthase kinase-3beta (GSK3B) | Serine/threonine-protein kinase GSK3B
Type:Enzyme
Mol. Mass.:46756.38
Organism:Homo sapiens (Human)
Description:P49841
Residue:420
BDBM50234810
NameBDBM50234810
Synonyms:CHEMBL4065167
TypeSmall organic molecule
Emp. Form.C20H20N2O4S
Mol. Mass.384.449
SMILESCCS(=O)(=O)c1ccc(OC)c(Nc2ncc(\C=C\c3ccccc3)o2)c1