Reaction Details
TargetDual specificity tyrosine-phosphorylation-regulated kinase 1A
LigandBDBM50234808
Substrate/Competitorn/a
Meas. Tech.ChEMBL_1653989 (CHEMBL4003355)
IC50 55±n/a nM
Citation Murár, MDobia?, J?ramel, PAddová, GHanquet, GBohác, A Novel CLK1 inhibitors based on N-aryloxazol-2-amine skeleton - A possible way to dual VEGFR2 TK/CLK ligands. Eur J Med Chem126:754-761 (2017) 
 
Dual specificity tyrosine-phosphorylation-regulated kinase 1A
Name:Dual specificity tyrosine-phosphorylation-regulated kinase 1A
Type:Enzyme
Mol. Mass.:85616.61
Organism:Homo sapiens (Human)
Description:Q13627
Residue:763
BDBM50234808
NameBDBM50234808
Synonyms:CHEMBL4090007
TypeSmall organic molecule
Emp. Form.C15H13Cl2N3O2
Mol. Mass.338.189
SMILESCCOC(=O)c1c(\C(=C\N)C#N)c2ccc(Cl)c(Cl)c2n1C