Reaction Details
TargetDual specificity protein kinase CLK1
LigandBDBM50234812
Substrate/Competitorn/a
Meas. Tech.ChEMBL_1653990 (CHEMBL4003356)
IC50 30±n/a nM
Citation Murár, MDobia?, J?ramel, PAddová, GHanquet, GBohác, A Novel CLK1 inhibitors based on N-aryloxazol-2-amine skeleton - A possible way to dual VEGFR2 TK/CLK ligands. Eur J Med Chem126:754-761 (2017) 
 
Dual specificity protein kinase CLK1
Name:Dual specificity protein kinase CLK1
Type:Protein
Mol. Mass.:57322.21
Organism:Homo sapiens (Human)
Description:P49759
Residue:484
BDBM50234812
NameBDBM50234812
Synonyms:CHEMBL4078755
TypeSmall organic molecule
Emp. Form.C20H18N2O4S2
Mol. Mass.414.498
SMILESCCS(=O)(=O)c1ccc(OC)c(Nc2ncc(o2)-c2cc3ccccc3s2)c1