Reaction Details
TargetDual specificity protein kinase CLK1
LigandBDBM50234809
Substrate/Competitorn/a
Meas. Tech.ChEMBL_1653990 (CHEMBL4003356)
IC50 20±n/a nM
Citation Murár, MDobia?, J?ramel, PAddová, GHanquet, GBohác, A Novel CLK1 inhibitors based on N-aryloxazol-2-amine skeleton - A possible way to dual VEGFR2 TK/CLK ligands. Eur J Med Chem126:754-761 (2017) 
 
Dual specificity protein kinase CLK1
Name:Dual specificity protein kinase CLK1
Type:Protein
Mol. Mass.:57322.21
Organism:Homo sapiens (Human)
Description:P49759
Residue:484
BDBM50234809
NameBDBM50234809
Synonyms:CHEMBL4103030
TypeSmall organic molecule
Emp. Form.C23H22N2O5S
Mol. Mass.438.496
SMILESCCS(=O)(=O)c1ccc(OC)c(Nc2ncc(o2)-c2ccc3cc(OC)ccc3c2)c1