Reaction Details
TargetVascular endothelial growth factor receptor 2
LigandBDBM5875
Substrate/Competitorn/a
Meas. Tech.ChEMBL_1653995 (CHEMBL4003361)
IC50 22±n/a nM
Citation Murár, MDobia?, J?ramel, PAddová, GHanquet, GBohác, A Novel CLK1 inhibitors based on N-aryloxazol-2-amine skeleton - A possible way to dual VEGFR2 TK/CLK ligands. Eur J Med Chem126:754-761 (2017) 
 
Vascular endothelial growth factor receptor 2
Name:Vascular endothelial growth factor receptor 2
Type:Receptor Tyrosine Kinase
Mol. Mass.:151510.97
Organism:Homo sapiens (Human)
Description:P35968
Residue:1356
BDBM5875
NameBDBM5875
Synonyms:2-Anilino-5-aryloxazole 39 N-[5-(ethanesulfonyl)-2-methoxyphenyl]-5-[3-(pyridin-2-yl)phenyl]-1,3-oxazol-2-amine
TypeSmall organic molecule
Emp. Form.C23H21N3O4S
Mol. Mass.435.496
SMILESCCS(=O)(=O)c1ccc(OC)c(Nc2ncc(o2)-c2cccc(c2)-c2ccccn2)c1