Reaction Details
TargetMitogen-activated protein kinase 10
LigandBDBM50234890
Substrate/Competitorn/a
Meas. Tech.ChEMBL_1654061 (CHEMBL4003427)
IC50 0.300000±n/a nM
Citation Muth, FEl-Gokha, AAnsideri, FEitel, MDöring, ESievers-Engler, ALange, ABoeckler, FMLämmerhofer, MKoch, PLaufer, SA Tri- and Tetrasubstituted Pyridinylimidazoles as Covalent Inhibitors of c-Jun N-Terminal Kinase 3. J Med Chem60:594-607 (2017) 
 
Mitogen-activated protein kinase 10
Name:Mitogen-activated protein kinase 10
Type:Enzyme
Mol. Mass.:52586.89
Organism:Homo sapiens (Human)
Description:n/a
Residue:464
BDBM50234890
NameBDBM50234890
Synonyms:CHEMBL4077018
TypeSmall organic molecule
Emp. Form.C32H27FN6O2S
Mol. Mass.578.659
SMILESCSc1nc(c(-c2ccnc(Nc3ccc(NC(=O)c4cccc(NC(=O)C=C)c4)cc3)c2)n1C)-c1ccc(F)cc1