Reaction Details
TargetTyrosine-protein kinase JAK1
LigandBDBM139694
Substrate/Competitorn/a
Meas. Tech.ChEMBL_1654088 (CHEMBL4003454)
IC50 2.2±n/a nM
Citation Jones, PStorer, RISabnis, YAWakenhut, FMWhitlock, GAEngland, KSMukaiyama, TDehnhardt, CMCoe, JWKortum, SWChrencik, JEBrown, DGJones, RMMurphy, JRYeoh, TMorgan, PKilty, I Design and Synthesis of a Pan-Janus Kinase Inhibitor Clinical Candidate (PF-06263276) Suitable for Inhaled and Topical Delivery for the Treatment of Inflammatory Diseases of the Lungs and Skin. J Med Chem60:767-786 (2017) 
 
Tyrosine-protein kinase JAK1
Name:Tyrosine-protein kinase JAK1
Type:Protein
Mol. Mass.:133293.73
Organism:Homo sapiens (Human)
Description:P23458
Residue:1154
BDBM139694
NameBDBM139694
Synonyms:US8895544, 4
TypeSmall organic molecule
Emp. Form.C31H31FN8O2
Mol. Mass.566.6286
SMILESCCc1cc(O)c(F)cc1-c1ccc2c(n[nH]c2c1)-c1nc2CN(CCc2[nH]1)C(=O)c1cnc(cn1)N1CCCCC1