Reaction Details
TargetTyrosine-protein kinase JAK3
LigandBDBM139691
Substrate/Competitorn/a
Meas. Tech.ChEMBL_1654086 (CHEMBL4003452)
IC50 1.7±n/a nM
Citation Jones, PStorer, RISabnis, YAWakenhut, FMWhitlock, GAEngland, KSMukaiyama, TDehnhardt, CMCoe, JWKortum, SWChrencik, JEBrown, DGJones, RMMurphy, JRYeoh, TMorgan, PKilty, I Design and Synthesis of a Pan-Janus Kinase Inhibitor Clinical Candidate (PF-06263276) Suitable for Inhaled and Topical Delivery for the Treatment of Inflammatory Diseases of the Lungs and Skin. J Med Chem60:767-786 (2017) 
 
Tyrosine-protein kinase JAK3
Name:Tyrosine-protein kinase JAK3
Type:Protein
Mol. Mass.:125111.08
Organism:Homo sapiens (Human)
Description:P52333
Residue:1124
BDBM139691
NameBDBM139691
Synonyms:US8895544, 1
TypeSmall organic molecule
Emp. Form.C28H23F2N5O2
Mol. Mass.499.5113
SMILESCCc1cc(O)c(F)cc1-c1ccc2c(n[nH]c2c1)-c1nc2CN(CCc2[nH]1)C(=O)c1ccc(F)cc1