Reaction Details
TargetPoly [ADP-ribose] polymerase tankyrase-1
LigandBDBM50234915
Substrate/Competitorn/a
Meas. Tech.ChEMBL_1654155 (CHEMBL4003521)
IC50 5.1±n/a nM
Citation Nathubhai, AHaikarainen, TKoivunen, JMurthy, SKoumanov, FLloyd, MDHolman, GDPihlajaniemi, TTosh, DLehtiö, LThreadgill, MD Highly Potent and Isoform Selective Dual Site Binding Tankyrase/Wnt Signaling Inhibitors That Increase Cellular Glucose Uptake and Have Antiproliferative Activity. J Med Chem60:814-820 (2017) 
 
Poly [ADP-ribose] polymerase tankyrase-1
Name:Poly [ADP-ribose] polymerase tankyrase-1
Type:Enzyme
Mol. Mass.:142058.03
Organism:Homo sapiens (Human)
Description:O95271
Residue:1327
BDBM50234915
NameBDBM50234915
Synonyms:CHEMBL4069447
TypeSmall organic molecule
Emp. Form.C28H23N5O3
Mol. Mass.477.5139
SMILESCc1cccc2c1nc(CCC(=O)Nc1ccc(cc1)C(=O)Nc1cccc3cccnc13)[nH]c2=O