Reaction Details
TargetProtein mono-ADP-ribosyltransferase PARP3
LigandBDBM50234916
Substrate/Competitorn/a
Meas. Tech.ChEMBL_1654153 (CHEMBL4003519)
IC50 39811±n/a nM
Citation Nathubhai, AHaikarainen, TKoivunen, JMurthy, SKoumanov, FLloyd, MDHolman, GDPihlajaniemi, TTosh, DLehtiö, LThreadgill, MD Highly Potent and Isoform Selective Dual Site Binding Tankyrase/Wnt Signaling Inhibitors That Increase Cellular Glucose Uptake and Have Antiproliferative Activity. J Med Chem60:814-820 (2017) 
 
Protein mono-ADP-ribosyltransferase PARP3
Name:Protein mono-ADP-ribosyltransferase PARP3
Type:PROTEIN
Mol. Mass.:60091.40
Organism:Homo sapiens (Human)
Description:ChEMBL_109545
Residue:533
BDBM50234916
NameBDBM50234916
Synonyms:CHEMBL4098188
TypeSmall organic molecule
Emp. Form.C27H21N5O3
Mol. Mass.463.4873
SMILESO=C(CCc1nc2ccccc2c(=O)[nH]1)Nc1ccc(cc1)C(=O)Nc1cccc2cccnc12