Reaction Details
TargetHistone acetyltransferase KAT2B
LigandBDBM311486
Substrate/Competitorn/a
Meas. Tech.ChEMBL_1654184 (CHEMBL4003550)
IC50 19±n/a nM
Citation Humphreys, PGBamborough, PChung, CWCraggs, PDGordon, LGrandi, PHayhow, TGHussain, JJones, KLLindon, MMichon, AMRenaux, JFSuckling, CJTough, DFPrinjha, RK Discovery of a Potent, Cell Penetrant, and Selective p300/CBP-Associated Factor (PCAF)/General Control Nonderepressible 5 (GCN5) Bromodomain Chemical Probe. J Med Chem60:695-709 (2017) 
 
Histone acetyltransferase KAT2B
Name:Histone acetyltransferase KAT2B
Type:PROTEIN
Mol. Mass.:93045.76
Organism:Homo sapiens (Human)
Description:ChEMBL_1502838
Residue:832
BDBM311486
NameBDBM311486
Synonyms:CHEM-US-00192 | US10155764, Example 65B
TypeSmall organic molecule
Emp. Form.C19H23N5O
Mol. Mass.337.4188
SMILESC[C@@H](Nc1nn(C)c(=O)c2cccnc12)[C@H](N(C)C)c1ccccc1