Reaction Details
TargetHistone acetyltransferase KAT2B
LigandBDBM50234939
Substrate/Competitorn/a
Meas. Tech.ChEMBL_1654185 (CHEMBL4003551)
IC50 79±n/a nM
Citation Humphreys, PGBamborough, PChung, CWCraggs, PDGordon, LGrandi, PHayhow, TGHussain, JJones, KLLindon, MMichon, AMRenaux, JFSuckling, CJTough, DFPrinjha, RK Discovery of a Potent, Cell Penetrant, and Selective p300/CBP-Associated Factor (PCAF)/General Control Nonderepressible 5 (GCN5) Bromodomain Chemical Probe. J Med Chem60:695-709 (2017) 
 
Histone acetyltransferase KAT2B
Name:Histone acetyltransferase KAT2B
Type:PROTEIN
Mol. Mass.:93045.76
Organism:Homo sapiens (Human)
Description:ChEMBL_1502838
Residue:832
BDBM50234939
NameBDBM50234939
Synonyms:CHEMBL4084253
TypeSmall organic molecule
Emp. Form.C17H21ClN4O
Mol. Mass.332.828
SMILESCN1C[C@@H](C[C@@H](C1)c1ccccc1)Nc1cnn(C)c(=O)c1Cl