Reaction Details
TargetSerine/threonine-protein kinase Nek2
LigandBDBM50235015
Substrate/Competitorn/a
Meas. Tech.ChEMBL_1654329 (CHEMBL4003695)
IC50 7±n/a nM
Citation Xi, JBFang, YFFrett, BZhu, MLZhu, TKong, YNGuan, FJZhao, YZhang, XWLi, HYMa, MLHu, W Structure-based design and synthesis of imidazo[1,2-a]pyridine derivatives as novel and potent Nek2 inhibitors with in vitro and in vivo antitumor activities. Eur J Med Chem126:1083-1106 (2017) 
 
Serine/threonine-protein kinase Nek2
Name:Serine/threonine-protein kinase Nek2
Type:Enzyme
Mol. Mass.:51776.96
Organism:Homo sapiens (Human)
Description:P51955
Residue:445
BDBM50235015
NameBDBM50235015
Synonyms:CHEMBL4091089
TypeSmall organic molecule
Emp. Form.C29H27F3N6O2
Mol. Mass.548.5589
SMILESCN(C)CCn1cc(cn1)-c1ccn2c(cnc2c1)-c1ccc(C(N)=O)c(OCc2cccc(c2)C(F)(F)F)c1