Reaction Details
TargetRibosomal protein S6 kinase alpha-1
LigandBDBM50234990
Substrate/Competitorn/a
Meas. Tech.ChEMBL_1654336 (CHEMBL4003702)
IC50 5.4±n/a nM
Citation Xi, JBFang, YFFrett, BZhu, MLZhu, TKong, YNGuan, FJZhao, YZhang, XWLi, HYMa, MLHu, W Structure-based design and synthesis of imidazo[1,2-a]pyridine derivatives as novel and potent Nek2 inhibitors with in vitro and in vivo antitumor activities. Eur J Med Chem126:1083-1106 (2017) 
 
Ribosomal protein S6 kinase alpha-1
Name:Ribosomal protein S6 kinase alpha-1
Type:Serine/threonine-protein kinase
Mol. Mass.:82736.10
Organism:Homo sapiens (Human)
Description:n/a
Residue:735
BDBM50234990
NameBDBM50234990
Synonyms:CHEMBL4062453
TypeSmall organic molecule
Emp. Form.C28H27FN6O2
Mol. Mass.498.5514
SMILESCN(C)CCn1cc(cn1)-c1ccn2c(cnc2c1)-c1ccc(C(N)=O)c(OCc2cccc(F)c2)c1