Reaction Details
TargetSodium/glucose cotransporter 2
LigandBDBM176544
Substrate/Competitorn/a
Meas. Tech.ChEMBL_1654380 (CHEMBL4003746)
IC50 3.6±n/a nM
Citation Goodwin, NCDing, ZMHarrison, BAStrobel, EDHarris, ALSmith, MThompson, AYXiong, WMseeh, FBruce, DJDiaz, DGopinathan, SLi, LO'Neill, EThiel, MWilson, AGCarson, KGPowell, DRRawlins, DB Discovery of LX2761, a Sodium-Dependent Glucose Cotransporter 1 (SGLT1) Inhibitor Restricted to the Intestinal Lumen, for the Treatment of Diabetes. J Med Chem60:710-721 (2017) 
 
Sodium/glucose cotransporter 2
Name:Sodium/glucose cotransporter 2
Type:Protein
Mol. Mass.:72902.00
Organism:Homo sapiens (Human)
Description:P31639
Residue:672
BDBM176544
NameBDBM176544
Synonyms:US9688710, 104 2,2-dimethyl-3-((4-(4-(2-methyl-5-((3R,4R,5S,6R)-3,4,5-trihydroxy-6-(methylthio)tetrahydro-2H-pyran-2-yl)benzyl)phenyl)butyl)amino)propanamide
TypeSmall organic molecule
Emp. Form.C29H42N2O5S
Mol. Mass.530.719
SMILESCS[C@H]1O[C@H]([C@H](O)[C@@H](O)[C@@H]1O)c1ccc(C)c(Cc2ccc(CCCCNCC(C)(C)C(N)=O)cc2)c1