Reaction Details
TargetSodium/glucose cotransporter 1
LigandBDBM176724
Substrate/Competitorn/a
Meas. Tech.ChEMBL_1654379 (CHEMBL4003745)
IC50 2.0±n/a nM
Citation Goodwin, NCDing, ZMHarrison, BAStrobel, EDHarris, ALSmith, MThompson, AYXiong, WMseeh, FBruce, DJDiaz, DGopinathan, SLi, LO'Neill, EThiel, MWilson, AGCarson, KGPowell, DRRawlins, DB Discovery of LX2761, a Sodium-Dependent Glucose Cotransporter 1 (SGLT1) Inhibitor Restricted to the Intestinal Lumen, for the Treatment of Diabetes. J Med Chem60:710-721 (2017) 
 
Sodium/glucose cotransporter 1
Name:Sodium/glucose cotransporter 1
Type:Protein
Mol. Mass.:73503.78
Organism:Homo sapiens (Human)
Description:P13866
Residue:664
BDBM176724
NameBDBM176724
Synonyms:US9688710, 146 (3R,4R,5S,6R)-2-(3-(4-(3-((3-(dimethylamino)-2,2-dimethylpropyl)amino)propoxy)benzyl)-4-methylphenyl)-6-(methylthio)tetrahydro-2H-pyran-3,4,5-triol
TypeSmall organic molecule
Emp. Form.C30H46N2O5S
Mol. Mass.546.762
SMILESCS[C@H]1O[C@H]([C@H](O)[C@@H](O)[C@@H]1O)c1ccc(C)c(Cc2ccc(OCCCNCC(C)(C)CN(C)C)cc2)c1