Reaction Details
TargetDual specificity protein kinase CLK3
LigandBDBM50235024
Substrate/Competitorn/a
Meas. Tech.ChEMBL_1654404 (CHEMBL4003770)
IC50>1000±n/a nM
Citation Shi, YPark, JLagisetti, CZhou, WSambucetti, LCWebb, TR A triple exon-skipping luciferase reporter assay identifies a new CLK inhibitor pharmacophore. Bioorg Med Chem Lett27:406-412 (2017) 
 
Dual specificity protein kinase CLK3
Name:Dual specificity protein kinase CLK3
Type:Protein
Mol. Mass.:73570.11
Organism:Homo sapiens (Human)
Description:n/a
Residue:638
BDBM50235024
NameBDBM50235024
Synonyms:CHEMBL4088144
TypeSmall organic molecule
Emp. Form.C20H26ClN7
Mol. Mass.399.92
SMILESCC(C)n1cnc2c(Nc3cccc(Cl)c3)nc(N[C@H]3CCCC[C@@H]3N)nc12