Reaction Details
TargetDual specificity protein kinase CLK3
LigandBDBM50073765
Substrate/Competitorn/a
Meas. Tech.ChEMBL_1654404 (CHEMBL4003770)
IC50>1000±n/a nM
Citation Shi, YPark, JLagisetti, CZhou, WSambucetti, LCWebb, TR A triple exon-skipping luciferase reporter assay identifies a new CLK inhibitor pharmacophore. Bioorg Med Chem Lett27:406-412 (2017) 
 
Dual specificity protein kinase CLK3
Name:Dual specificity protein kinase CLK3
Type:Protein
Mol. Mass.:73570.11
Organism:Homo sapiens (Human)
Description:n/a
Residue:638
BDBM50073765
NameBDBM50073765
Synonyms:CHEMBL367625 | N*2*-((1R,2S)-2-Amino-cyclohexyl)-N*6*-(3-chloro-phenyl)-9-ethyl-9H-purine-2,6-diamine
TypeSmall organic molecule
Emp. Form.C19H24ClN7
Mol. Mass.385.894
SMILESCCn1cnc2c(Nc3cccc(Cl)c3)nc(N[C@@H]3CCCC[C@@H]3N)nc12