Reaction Details
TargetCyclin-dependent kinase 4/G1/S-specific cyclin-D3
LigandBDBM50235029
Substrate/Competitorn/a
Meas. Tech.ChEMBL_1654407 (CHEMBL4003773)
IC50>1000±n/a nM
Citation Shi, YPark, JLagisetti, CZhou, WSambucetti, LCWebb, TR A triple exon-skipping luciferase reporter assay identifies a new CLK inhibitor pharmacophore. Bioorg Med Chem Lett27:406-412 (2017) 
 
Cyclin-dependent kinase 4/G1/S-specific cyclin-D3
Name:Cyclin-dependent kinase 4/G1/S-specific cyclin-D3
Synonyms:CDK4/Cyclin D3
Type:n/a
Mol. Mass.:n/a
Description:ASSAY_ID of ChEMBL is 1806445
Components:This complex has 2 components.
Component 1
Name:Cyclin-dependent kinase 4
Type:Enzyme Subunit
Mol. Mass.:33731.96
Organism:Homo sapiens (Human)
Description:P11802
Residue:303
Component 2
Name:G1/S-specific cyclin-D3
Synonyms:CCND3 | CCND3_HUMAN
Type:Enzyme
Mol. Mass.:32521.90
Organism:Homo sapiens (Human)
Description:P30281
Residue:292
BDBM50235029
NameBDBM50235029
Synonyms:CHEMBL4084116
TypeSmall organic molecule
Emp. Form.C18H23ClN8
Mol. Mass.386.882
SMILESCC(C)n1cnc2c(Nc3cc(N)cc(Cl)c3)nc(N[C@@H]3CCNC3)nc12