Reaction Details
TargetDual specificity protein kinase CLK2
LigandBDBM50235030
Substrate/Competitorn/a
Meas. Tech.ChEMBL_1654403 (CHEMBL4003769)
IC50 34±n/a nM
Citation Shi, YPark, JLagisetti, CZhou, WSambucetti, LCWebb, TR A triple exon-skipping luciferase reporter assay identifies a new CLK inhibitor pharmacophore. Bioorg Med Chem Lett27:406-412 (2017) 
 
Dual specificity protein kinase CLK2
Name:Dual specificity protein kinase CLK2
Type:n/a
Mol. Mass.:60128.79
Organism:Homo sapiens (Human)
Description:P49760
Residue:499
BDBM50235030
NameBDBM50235030
Synonyms:CHEMBL4091876
TypeSmall organic molecule
Emp. Form.C19H25ClN8
Mol. Mass.400.908
SMILESCC(C)n1cnc2c(Nc3cc(N)cc(Cl)c3)nc(N[C@@H]3CCCNC3)nc12