Reaction Details
TargetDual specificity protein kinase CLK1
LigandBDBM50235022
Substrate/Competitorn/a
Meas. Tech.ChEMBL_1654402 (CHEMBL4003768)
IC50 17±n/a nM
Citation Shi, YPark, JLagisetti, CZhou, WSambucetti, LCWebb, TR A triple exon-skipping luciferase reporter assay identifies a new CLK inhibitor pharmacophore. Bioorg Med Chem Lett27:406-412 (2017) 
 
Dual specificity protein kinase CLK1
Name:Dual specificity protein kinase CLK1
Type:Protein
Mol. Mass.:57322.21
Organism:Homo sapiens (Human)
Description:P49759
Residue:484
BDBM50235022
NameBDBM50235022
Synonyms:CHEMBL4078898
TypeSmall organic molecule
Emp. Form.C20H27ClN8
Mol. Mass.414.935
SMILESCC(C)n1cnc2c(Nc3cc(N)cc(Cl)c3)nc(N[C@@H]3CCCC[C@@H]3N)nc12