Reaction Details
TargetAdenosine receptor A2a
LigandBDBM50235045
Substrate/Competitorn/a
Meas. Tech.ChEMBL_1654441 (CHEMBL4003807)
Ki 1.000000±n/a nM
Citation Basu, SBarawkar, DAThorat, SShejul, YDPatel, MNaykodi, MJain, VSalve, YPrasad, VChaudhary, SGhosh, IBhat, GQuraishi, APatil, HAnsari, SMenon, SUnadkat, VThakare, RSeervi, MSMeru, AVDe, SBhamidipati, RKRouduri, SRPalle, VPChug, AMookhtiar, KA Design, Synthesis of Novel, Potent, Selective, Orally Bioavailable Adenosine A J Med Chem60:681-694 (2017) 
 
Adenosine receptor A2a
Name:Adenosine receptor A2a
Type:G Protein-Coupled Receptor (GPCR)
Mol. Mass.:44716.46
Organism:Homo sapiens (Human)
Description:P29274
Residue:412
BDBM50235045
NameBDBM50235045
Synonyms:CHEMBL4086751
TypeSmall organic molecule
Emp. Form.C22H23F2N3O4S
Mol. Mass.463.498
SMILESCOc1ccc(N2CCOCC2)c2sc(NC(=O)C(C)(C)Oc3c(F)cccc3F)nc12