Reaction Details
TargetSodium/glucose cotransporter 1
LigandBDBM20875
Substrate/Competitorn/a
Meas. Tech.ChEMBL_1654733 (CHEMBL4004099)
IC50 499±n/a nM
Citation Jesus, ARVila-Viçosa, DMachuqueiro, MMarques, APDore, TMRauter, AP Targeting Type 2 Diabetes with C-Glucosyl Dihydrochalcones as Selective Sodium Glucose Co-Transporter 2 (SGLT2) Inhibitors: Synthesis and Biological Evaluation. J Med Chem60:568-579 (2017) 
 
Sodium/glucose cotransporter 1
Name:Sodium/glucose cotransporter 1
Type:Protein
Mol. Mass.:73503.78
Organism:Homo sapiens (Human)
Description:P13866
Residue:664
BDBM20875
NameBDBM20875
Synonyms:1-(2,4-dihydroxy-6-{[(2S,3R,4S,5S,6R)-3,4,5-trihydroxy-6-(hydroxymethyl)oxan-2-yl]oxy}phenyl)-3-(4-hydroxyphenyl)propan-1-one CHEMBL245067 O-glucoside, 1 | Phlorizin
TypeNatural product
Emp. Form.C21H24O10
Mol. Mass.436.4093
SMILESOC[C@H]1O[C@@H](Oc2cc(O)cc(O)c2C(=O)CCc2ccc(O)cc2)[C@H](O)[C@@H](O)[C@@H]1O