Reaction Details
TargetTissue factor
LigandBDBM50235149
Substrate/Competitorn/a
Meas. Tech.ChEMBL_1654816 (CHEMBL4004182)
IC50 0.028000±n/a nM
Citation Wang, WWXu, SHZhao, YZZhang, CZhang, YYYu, BYZhang, J Microbial hydroxylation and glycosylation of pentacyclic triterpenes as inhibitors on tissue factor procoagulant activity. Bioorg Med Chem Lett27:1026-1030 (2017) 
 
Tissue factor
Name:Tissue factor
Type:PROTEIN
Mol. Mass.:33067.61
Organism:Homo sapiens (Human)
Description:ChEMBL_936735
Residue:295
BDBM50235149
NameBDBM50235149
Synonyms:CHEMBL4066780
TypeSmall organic molecule
Emp. Form.C36H58O9
Mol. Mass.634.8403
SMILES[H][C@@]12[C@@H](CC[C@@]1(CC[C@]1(C)C2CC[C@]2([H])[C@@]3(C)CC[C@H](O)[C@@](C)(CO)[C@]3([H])CC[C@@]12C)C(=O)O[C@@H]1O[C@H](CO)[C@@H](O)[C@H](O)[C@H]1O)C(C)=C