Reaction Details
TargetProtein kinase C alpha type
LigandBDBM206104
Substrate/Competitorn/a
Meas. Tech.ChEMBL_1654865 (CHEMBL4004231)
IC50>50000±n/a nM
Citation Miura, TMatsuo, AMuraoka, TIde, MMorikami, KKamikawa, TNishihara, MKashiwagi, H Identification of a selective inhibitor of transforming growth factorß-activated kinase 1 by biosensor-based screening of focused libraries. Bioorg Med Chem Lett27:1031-1036 (2017) 
 
Protein kinase C alpha type
Name:Protein kinase C alpha type
Type:Enzyme
Mol. Mass.:76755.65
Organism:Homo sapiens (Human)
Description:The recombinant human PKC enzymes were produced using a baculovirus expression system in SF9 cells
Residue:672
BDBM206104
NameBDBM206104
Synonyms:US9255110, 17
TypeSmall organic molecule
Emp. Form.C17H12N4O2S
Mol. Mass.336.368
SMILESCOc1cc2ncccc2cc1NC(=O)c1csc2cncnc12