Reaction Details
TargetMitogen-activated protein kinase kinase kinase 7
LigandBDBM18137
Substrate/Competitorn/a
Meas. Tech.ChEMBL_1654823 (CHEMBL4004189)
Kd 120000±n/a nM
Citation Miura, TMatsuo, AMuraoka, TIde, MMorikami, KKamikawa, TNishihara, MKashiwagi, H Identification of a selective inhibitor of transforming growth factorß-activated kinase 1 by biosensor-based screening of focused libraries. Bioorg Med Chem Lett27:1031-1036 (2017) 
 
Mitogen-activated protein kinase kinase kinase 7
Name:Mitogen-activated protein kinase kinase kinase 7
Type:Protein
Mol. Mass.:67199.89
Organism:Homo sapiens (Human)
Description:O43318
Residue:606
BDBM18137
NameBDBM18137
Synonyms:AMP US11185100, TABLE 7.3 adenosine 5 -monophosphate | {[(2R,3S,4R,5R)-5-(6-amino-9H-purin-9-yl)-3,4-dihydroxyoxolan-2-yl]methoxy}phosphonic acid
TypeNucleoside or nucleotide
Emp. Form.C10H14N5O7P
Mol. Mass.347.2212
SMILESNc1ncnc2n(cnc12)[C@@H]1O[C@H](COP(O)(O)=O)[C@@H](O)[C@H]1O