Reaction Details
TargetATP-sensitive inward rectifier potassium channel 1
LigandBDBM50235196
Substrate/Competitorn/a
Meas. Tech.ChEMBL_1654962 (CHEMBL4004328)
IC50 40±n/a nM
Citation Chobanian, HRGuo, YPio, BTang, HTeumelsan, NClements, MFrie, JFerguson, RGuo, ZThomas-Fowlkes, BSFelix, JPLiu, JKohler, MPriest, BHampton, CPai, LYCorona, AMetzger, JTong, VJoshi, EMXu, LOwens, KMaloney, KSullivan, KPasternak, A The design and synthesis of novel spirocyclic heterocyclic sulfone ROMK inhibitors as diuretics. Bioorg Med Chem Lett27:1109-1114 (2017) 
 
ATP-sensitive inward rectifier potassium channel 1
Name:ATP-sensitive inward rectifier potassium channel 1
Type:Enzyme
Mol. Mass.:44976.27
Organism:Rattus norvegicus (Rat)
Description:P35560
Residue:391
BDBM50235196
NameBDBM50235196
Synonyms:CHEMBL4064760
TypeSmall organic molecule
Emp. Form.C24H30N4O5S
Mol. Mass.486.584
SMILESCc1c2COC(=O)c2ccc1[C@@H](O)CN1CCC2(CCN(C2)c2cnc(cn2)S(C)(=O)=O)CC1