Reaction Details
TargetATP-sensitive inward rectifier potassium channel 1
LigandBDBM50235196
Substrate/Competitorn/a
Meas. Tech.ChEMBL_1654945 (CHEMBL4004311)
IC50 44±n/a nM
Citation Chobanian, HRGuo, YPio, BTang, HTeumelsan, NClements, MFrie, JFerguson, RGuo, ZThomas-Fowlkes, BSFelix, JPLiu, JKohler, MPriest, BHampton, CPai, LYCorona, AMetzger, JTong, VJoshi, EMXu, LOwens, KMaloney, KSullivan, KPasternak, A The design and synthesis of novel spirocyclic heterocyclic sulfone ROMK inhibitors as diuretics. Bioorg Med Chem Lett27:1109-1114 (2017) 
 
ATP-sensitive inward rectifier potassium channel 1
Name:ATP-sensitive inward rectifier potassium channel 1
Type:Enzyme Catalytic Domain
Mol. Mass.:44809.08
Organism:Homo sapiens (Human)
Description:gi_223460826
Residue:391
BDBM50235196
NameBDBM50235196
Synonyms:CHEMBL4064760
TypeSmall organic molecule
Emp. Form.C24H30N4O5S
Mol. Mass.486.584
SMILESCc1c2COC(=O)c2ccc1[C@@H](O)CN1CCC2(CCN(C2)c2cnc(cn2)S(C)(=O)=O)CC1