Reaction Details
TargetPotassium voltage-gated channel subfamily H member 2
LigandBDBM50391781
Substrate/Competitorn/a
Meas. Tech.ChEMBL_1654946 (CHEMBL4004312)
IC50 170±n/a nM
Citation Chobanian, HRGuo, YPio, BTang, HTeumelsan, NClements, MFrie, JFerguson, RGuo, ZThomas-Fowlkes, BSFelix, JPLiu, JKohler, MPriest, BHampton, CPai, LYCorona, AMetzger, JTong, VJoshi, EMXu, LOwens, KMaloney, KSullivan, KPasternak, A The design and synthesis of novel spirocyclic heterocyclic sulfone ROMK inhibitors as diuretics. Bioorg Med Chem Lett27:1109-1114 (2017) 
 
Potassium voltage-gated channel subfamily H member 2
Name:Potassium voltage-gated channel subfamily H member 2
Type:Multi-pass membrane protein
Mol. Mass.:126672.65
Organism:Homo sapiens (Human)
Description:Q12809
Residue:1159
BDBM50391781
NameBDBM50391781
Synonyms:CHEMBL2146873 | US9073882, 38
TypeSmall organic molecule
Emp. Form.C23H24FN3O2
Mol. Mass.393.454
SMILESFc1cc(CCN2CCN(CCc3ccc4C(=O)OCc4c3)CC2)ccc1C#N