Reaction Details
TargetCarboxylic ester hydrolase
LigandBDBM50159614
Substrate/Competitorn/a
Meas. Tech.ChEMBL_1655009 (CHEMBL4004375)
IC50 3.2±n/a nM
Citation Singh, HSingh, JVGupta, MKSingh, PSharma, SNepali, KBedi, PMS Benzoflavones as cholesterol esterase inhibitors: Synthesis, biological evaluation and docking studies. Bioorg Med Chem Lett27:850-854 (2017) 
 
Carboxylic ester hydrolase
Name:Carboxylic ester hydrolase
Type:PROTEIN
Mol. Mass.:63554.81
Organism:Sus scrofa
Description:ChEMBL_117582
Residue:585
BDBM50159614
NameBDBM50159614
Synonyms:2-(2-Fluoro-phenyl)-benzo[h]chromen-4-one | CHEMBL361608
TypeSmall organic molecule
Emp. Form.C19H11FO2
Mol. Mass.290.2878
SMILESFc1ccccc1-c1cc(=O)c2ccc3ccccc3c2o1