Reaction Details
TargetPotassium voltage-gated channel subfamily H member 2
LigandBDBM50235240
Substrate/Competitorn/a
Meas. Tech.ChEMBL_1655139 (CHEMBL4004505)
IC50>30000±n/a nM
Citation Wolkenberg, SENolt, MBBilodeau, MTTrotter, BWManley, PJKett, NRNanda, KKWu, ZCato, MJKane, SAKiss, LSpencer, RHWang, JLynch, JJRegan, CPStump, GLLi, BWhite, RYeh, SDinsmore, CJLindsley, CWHartman, GD Discovery of MK-1832, a Kv1.5 inhibitor with improved selectivity and pharmacokinetics. Bioorg Med Chem Lett27:1062-1069 (2017) 
 
Potassium voltage-gated channel subfamily H member 2
Name:Potassium voltage-gated channel subfamily H member 2
Type:Multi-pass membrane protein
Mol. Mass.:126672.65
Organism:Homo sapiens (Human)
Description:Q12809
Residue:1159
BDBM50235240
NameBDBM50235240
Synonyms:CHEMBL4065169
TypeSmall organic molecule
Emp. Form.C24H21FN4O2S
Mol. Mass.448.513
SMILESCS(=O)(=O)Nc1cccc(n1)[C@@H](C(c1cccnc1)c1cccnc1)c1ccc(F)cc1